Reaction Details
TargetCytochrome P450 1B1
LigandBDBM50325674
Substrate/Competitorn/a
Meas. Tech.ChEMBL_652515 (CHEMBL1225718)
IC50 20±n/a nM
Citation Takemura, HItoh, TYamamoto, KSakakibara, HShimoi, K Selective inhibition of methoxyflavonoids on human CYP1B1 activity. Bioorg Med Chem18:6310-5 (2010) 
 
Cytochrome P450 1B1
Name:Cytochrome P450 1B1
Type:PROTEIN
Mol. Mass.:60861.81
Organism:Homo sapiens (Human)
Description:ChEMBL_1474523
Residue:543
BDBM50325674
NameBDBM50325674
Synonyms:3,5,7-trihydroxy-2-(3-hydroxy-4-methoxyphenyl)-4H-chromen-4-one Tamarixetin (22) | tamarixetin
TypeSmall organic molecule
Emp. Form.C16H12O7
Mol. Mass.316.2623
SMILESCOc1ccc(cc1O)-c1oc2cc(O)cc(O)c2c(=O)c1O