Reaction Details
TargetC-C chemokine receptor type 1
LigandBDBM50325719
Substrate/Competitorn/a
Meas. Tech.ChEMBL_652569 (CHEMBL1225772)
IC50 20±n/a nM
Citation Merritt, JRJames, RParadkar, VMZhang, CLiu, RLiu, JJacob, BChiriac, COhlmeyer, MJQuadros, EWines, PPostelnek, JHicks, CMChen, WKimble, EFO'Brien, LWhite, NDesai, HAppell, KCWebb, ML Novel pyrrolidine heterocycles as CCR1 antagonists. Bioorg Med Chem Lett20:5477-9 (2010) 
 
C-C chemokine receptor type 1
Name:C-C chemokine receptor type 1
Type:Enzyme
Mol. Mass.:41180.69
Organism:Homo sapiens (Human)
Description:P32246
Residue:355
BDBM50325719
NameBDBM50325719
Synonyms:(R)-2-(1-(4-chlorobenzyl)-1H-tetrazol-5-yl)-N-(4-(trifluoromethyl)phenyl)pyrrolidine-1-carboxamide | CHEMBL1224119
TypeSmall organic molecule
Emp. Form.C20H18ClF3N6O
Mol. Mass.450.845
SMILESFC(F)(F)c1ccc(NC(=O)N2CCC[C@@H]2c2nnnn2Cc2ccc(Cl)cc2)cc1