Reaction Details
TargetC-C chemokine receptor type 1
LigandBDBM50325723
Substrate/Competitorn/a
Meas. Tech.ChEMBL_652570 (CHEMBL1225773)
IC50 2.9±n/a nM
Citation Merritt, JRJames, RParadkar, VMZhang, CLiu, RLiu, JJacob, BChiriac, COhlmeyer, MJQuadros, EWines, PPostelnek, JHicks, CMChen, WKimble, EFO'Brien, LWhite, NDesai, HAppell, KCWebb, ML Novel pyrrolidine heterocycles as CCR1 antagonists. Bioorg Med Chem Lett20:5477-9 (2010) 
 
C-C chemokine receptor type 1
Name:C-C chemokine receptor type 1
Type:Enzyme
Mol. Mass.:41180.69
Organism:Homo sapiens (Human)
Description:P32246
Residue:355
BDBM50325723
NameBDBM50325723
Synonyms:(R)-2-(4-(4-chlorobenzyl)-5-methyl-4H-1,2,4-triazol-3-yl)-N-(4-(trifluoromethyl)phenyl)pyrrolidine-1-carboxamide | CHEMBL1224189
TypeSmall organic molecule
Emp. Form.C22H21ClF3N5O
Mol. Mass.463.883
SMILESCc1nnc([C@H]2CCCN2C(=O)Nc2ccc(cc2)C(F)(F)F)n1Cc1ccc(Cl)cc1