Reaction Details
TargetcAMP-specific 3',5'-cyclic phosphodiesterase 4D
LigandBDBM50174022
Substrate/Competitorn/a
Meas. Tech.ChEMBL_652843 (CHEMBL1226046)
IC50 1.2±n/a nM
Citation Aspiotis, RDeschênes, DDubé, DGirard, YHuang, ZLaliberté, FLiu, SPapp, RNicholson, DWYoung, RN The discovery and synthesis of highly potent subtype selective phosphodiesterase 4D inhibitors. Bioorg Med Chem Lett20:5502-5 (2010) 
 
cAMP-specific 3',5'-cyclic phosphodiesterase 4D
Name:cAMP-specific 3',5'-cyclic phosphodiesterase 4D
Type:Protein
Mol. Mass.:91092.69
Organism:Homo sapiens (Human)
Description:Q08499
Residue:809
BDBM50174022
NameBDBM50174022
Synonyms:(E)-8-(3-(2-(3-methyl-1,2,4-oxadiazol-5-yl)-2-(4-(methylsulfonyl)phenyl)vinyl)phenyl)-6-(2-(methylsulfonyl)propan-2-yl)quinoline 8-(3-methoxyphenyl)-6-(pyridin-4-ylmethyl)quinoline L-454560
TypeSmall organic molecule
Emp. Form.C31H29N3O5S2
Mol. Mass.587.709
SMILESCc1noc(n1)C(=C\c1cccc(c1)-c1cc(cc2cccnc12)C(C)(C)S(C)(=O)=O)\c1ccc(cc1)S(C)(=O)=O