Reaction Details
Target5-hydroxytryptamine receptor 7
LigandBDBM50325822
Substrate/Competitorn/a
Meas. Tech.ChEMBL_652379 (CHEMBL1225582)
Ki 220000±n/a nM
Citation Bonner, LAChemel, BRWatts, VJNichols, DE Facile synthesis of octahydrobenzo[h]isoquinolines: novel and highly potent D1 dopamine agonists. Bioorg Med Chem18:6763-70 (2010) 
 
5-hydroxytryptamine receptor 7
Name:5-hydroxytryptamine receptor 7
Type:G Protein-Coupled Receptor (GPCR)
Mol. Mass.:53573.08
Organism:Homo sapiens (Human)
Description:P34969
Residue:479
BDBM50325822
NameBDBM50325822
Synonyms:CHEMBL1224527 | trans-(5R)-5-phenyl-1,2,3,4,4a,5,6,10b-octahydrobenzo[h]isoquinoline-7,8-diol
TypeSmall organic molecule
Emp. Form.C19H21NO2
Mol. Mass.295.3755
SMILESOc1ccc2[C@@H]3CNCC[C@H]3[C@@H](Cc2c1O)c1ccccc1