Reaction Details
TargetRho-associated protein kinase 2
LigandBDBM14027
Substrate/Competitorn/a
Meas. Tech.ChEMBL_660305 (CHEMBL1249801)
IC50 1900±n/a nM
Citation Davies, SPReddy, HCaivano, MCohen, P Specificity and mechanism of action of some commonly used protein kinase inhibitors. Biochem J351:95-105 (2001) Rho-associated protein kinase 2
Name:Rho-associated protein kinase 2
Type:Protein
Mol. Mass.:160370.90
Organism:Rattus norvegicus (Rat)
Description:Q62868
Residue:1388
BDBM14027
NameBDBM14027
Synonyms:5-(1,4-diazepan-1-ylsulfonyl)isoquinoline AT877 CHEMBL541388 HA-1077 cid_163751
TypeSmall organic molecule
Emp. Form.C14H17N3O2S
Mol. Mass.291.369
SMILESO=S(=O)(N1CCCNCC1)c1cccc2cnccc12