Reaction Details
TargetCyclin-dependent kinase 2
LigandBDBM50298225
Substrate/Competitorn/a
Meas. Tech.ChEMBL_660476 (CHEMBL1250106)
IC50 29000±n/a nM
Citation Saghatelian, ACravatt, BF Assignment of protein function in the postgenomic era. Nat Chem Biol1:130-42 (2006) 
 
Cyclin-dependent kinase 2
Name:Cyclin-dependent kinase 2
Type:Enzyme Subunit
Mol. Mass.:33938.17
Organism:Homo sapiens (Human)
Description:P24941
Residue:298
BDBM50298225
NameBDBM50298225
Synonyms:CHEMBL2069955 NM-PP1 US11247972, Compound 5d | US9765037, Compound 5d
TypeSmall organic molecule
Emp. Form.C20H21N5
Mol. Mass.331.4142
SMILESCC(C)(C)n1nc(Cc2cccc3ccccc23)c2c(N)ncnc12