Reaction Details
TargetVascular endothelial growth factor receptor 2
LigandBDBM50326001
Substrate/Competitorn/a
Meas. Tech.ChEMBL_660992 (CHEMBL1249724)
IC50 0.900000±n/a nM
Citation Liu, YGray, NS Rational design of inhibitors that bind to inactive kinase conformations. Nat Chem Biol2:358-64 (2006) 
 
Vascular endothelial growth factor receptor 2
Name:Vascular endothelial growth factor receptor 2
Type:Receptor Tyrosine Kinase
Mol. Mass.:151510.97
Organism:Homo sapiens (Human)
Description:P35968
Residue:1356
BDBM50326001
NameBDBM50326001
Synonyms:1-(2,4-difluorophenyl)-3-(4-(6,7-dimethoxyquinolin-4-yloxy)-2-methylphenyl)urea | CHEMBL1242557
TypeSmall organic molecule
Emp. Form.C25H21F2N3O4
Mol. Mass.465.4487
SMILESCOc1cc2nccc(Oc3ccc(NC(=O)Nc4ccc(F)cc4F)c(C)c3)c2cc1OC