Reaction Details
TargetTransient receptor potential cation channel subfamily M member 8
LigandBDBM50318482
Substrate/Competitorn/a
Meas. Tech.ChEMBL_654578 (CHEMBL1243622)
Kd 14400±n/a nM
Citation Voets, TOwsianik, GJanssens, ATalavera, KNilius, B TRPM8 voltage sensor mutants reveal a mechanism for integrating thermal and chemical stimuli. Nat Chem Biol3:174-82 (2007) 
 
Transient receptor potential cation channel subfamily M member 8
Name:Transient receptor potential cation channel subfamily M member 8
Type:Enzyme
Mol. Mass.:127693.26
Organism:Homo sapiens (Human)
Description:Q7Z2W7
Residue:1104
BDBM50318482
NameBDBM50318482
Synonyms:(-)-menthol MENTHOL l-menthol
TypeSmall organic molecule
Emp. Form.C10H20O
Mol. Mass.156.2652
SMILESCC(C)[C@@H]1CC[C@@H](C)C[C@H]1O