Reaction Details
TargetInsulin receptor
LigandBDBM50326005
Substrate/Competitorn/a
Meas. Tech.ChEMBL_654586 (CHEMBL1243630)
IC50 380±n/a nM
Citation Steiner, LBlum, GFriedmann, YLevitzki, A ATP non-competitive IGF-1 receptor kinase inhibitors as lead anti-neoplastic and anti-papilloma agents. Eur J Pharmacol562:1-11 (2007) 
 
Insulin receptor
Name:Insulin receptor
Type:Receptor Tyrosine Kinase
Mol. Mass.:156322.60
Organism:Homo sapiens (Human)
Description:P06213
Residue:1382
BDBM50326005
NameBDBM50326005
Synonyms:4,4'-(1H-indazol-6-ylazanediyl)bis(methylene)dibenzene-1,2-diol | CHEMBL1241669
TypeSmall organic molecule
Emp. Form.C21H19N3O4
Mol. Mass.377.3933
SMILESOc1ccc(CN(Cc2ccc(O)c(O)c2)c2ccc3cn[nH]c3c2)cc1O