Reaction Details
TargetProto-oncogene tyrosine-protein kinase Src
LigandBDBM50326003
Substrate/Competitorn/a
Meas. Tech.ChEMBL_654587 (CHEMBL1243631)
IC50 1860±n/a nM
Citation Steiner, LBlum, GFriedmann, YLevitzki, A ATP non-competitive IGF-1 receptor kinase inhibitors as lead anti-neoplastic and anti-papilloma agents. Eur J Pharmacol562:1-11 (2007) 
 
Proto-oncogene tyrosine-protein kinase Src
Name:Proto-oncogene tyrosine-protein kinase Src
Type:Protein
Mol. Mass.:59838.60
Organism:Homo sapiens (Human)
Description:P12931
Residue:536
BDBM50326003
NameBDBM50326003
Synonyms:4-((benzo[d][1,3]dioxol-5-ylamino)methyl)benzene-1,2-diol | CHEMBL1240829
TypeSmall organic molecule
Emp. Form.C14H13NO4
Mol. Mass.259.2573
SMILESOc1ccc(CNc2ccc3OCOc3c2)cc1O