Reaction Details
TargetMyosin light chain kinase, smooth muscle
LigandBDBM50326009
Substrate/Competitorn/a
Meas. Tech.ChEMBL_654869 (CHEMBL1243913)
IC50 10000±n/a nM
Citation Meisner, NCHintersteiner, MMueller, KBauer, RSeifert, JMNaegeli, HUOttl, JOberer, LGuenat, CMoss, SHarrer, NWoisetschlaeger, MBuehler, CUhl, VAuer, M Identification and mechanistic characterization of low-molecular-weight inhibitors for HuR. Nat Chem Biol3:508-15 (2007) 
 
Myosin light chain kinase, smooth muscle
Name:Myosin light chain kinase, smooth muscle
Type:Protein
Mol. Mass.:210702.56
Organism:Homo sapiens (Human)
Description:Q15746
Residue:1914
BDBM50326009
NameBDBM50326009
Synonyms:5,8-dihydroxy-3-methylnaphtho[2,3-c]furan-4(9H)-one | CHEMBL1240928
TypeSmall organic molecule
Emp. Form.C13H10O4
Mol. Mass.230.2161
SMILESCc1occ2Cc3c(O)ccc(O)c3C(=O)c12