Reaction Details
TargetELAV-like protein 1
LigandBDBM50326010
Substrate/Competitorn/a
Meas. Tech.ChEMBL_654856 (CHEMBL1243900)
Kd 6±n/a nM
Citation Meisner, NCHintersteiner, MMueller, KBauer, RSeifert, JMNaegeli, HUOttl, JOberer, LGuenat, CMoss, SHarrer, NWoisetschlaeger, MBuehler, CUhl, VAuer, M Identification and mechanistic characterization of low-molecular-weight inhibitors for HuR. Nat Chem Biol3:508-15 (2007) 
 
ELAV-like protein 1
Name:ELAV-like protein 1
Type:PROTEIN
Mol. Mass.:36102.56
Organism:Homo sapiens (Human)
Description:ChEMBL_654855
Residue:326
BDBM50326010
NameBDBM50326010
Synonyms:CHEMBL1242196 | Dehydromutactin
TypeSmall organic molecule
Emp. Form.C16H12O5
Mol. Mass.284.2635
SMILESCc1cc(O)c2c(O)cccc2c1-c1cc(O)cc(=O)o1