Reaction Details
TargetELAV-like protein 1
LigandBDBM50326009
Substrate/Competitorn/a
Meas. Tech.ChEMBL_654855 (CHEMBL1243899)
Kd 420±n/a nM
Citation Meisner, NCHintersteiner, MMueller, KBauer, RSeifert, JMNaegeli, HUOttl, JOberer, LGuenat, CMoss, SHarrer, NWoisetschlaeger, MBuehler, CUhl, VAuer, M Identification and mechanistic characterization of low-molecular-weight inhibitors for HuR. Nat Chem Biol3:508-15 (2007) 
 
ELAV-like protein 1
Name:ELAV-like protein 1
Type:PROTEIN
Mol. Mass.:36102.56
Organism:Homo sapiens (Human)
Description:ChEMBL_654855
Residue:326
BDBM50326009
NameBDBM50326009
Synonyms:5,8-dihydroxy-3-methylnaphtho[2,3-c]furan-4(9H)-one | CHEMBL1240928
TypeSmall organic molecule
Emp. Form.C13H10O4
Mol. Mass.230.2161
SMILESCc1occ2Cc3c(O)ccc(O)c3C(=O)c12