Reaction Details
TargetSerine/threonine-protein kinase 10
LigandBDBM4552
Substrate/Competitorn/a
Meas. Tech.ChEMBL_655296 (CHEMBL1244340)
IC50 52±n/a nM
Citation Remsing Rix, LLRix, UColinge, JHantschel, OBennett, KLStranzl, TMüller, ABaumgartner, CValent, PAugustin, MTill, JHSuperti-Furga, G Global target profile of the kinase inhibitor bosutinib in primary chronic myeloid leukemia cells. Leukemia23:477-85 (2009) 
 
Serine/threonine-protein kinase 10
Name:Serine/threonine-protein kinase 10
Type:Protein
Mol. Mass.:112139.54
Organism:Homo sapiens (Human)
Description:O94804
Residue:968
BDBM4552
NameBDBM4552
Synonyms:4-[(2,4-Dichloro-5-methoxyphenyl)amino]-6-methoxy-7-[3-(4-methyl-1-piperazinyl)propoxy]-3-quinolinecarbonitrile BOSUTINIB SKI-606
TypeSmall organic molecule
Emp. Form.C26H29Cl2N5O3
Mol. Mass.530.446
SMILESCOc1cc(Nc2c(cnc3cc(OCCCN4CCN(C)CC4)c(OC)cc23)C#N)c(Cl)cc1Cl