Reaction Details
TargetCathepsin G
LigandBDBM50326029
Substrate/Competitorn/a
Meas. Tech.ChEMBL_655591 (CHEMBL1244635)
IC50 100±n/a nM
Citation Heinis, CRutherford, TFreund, SWinter, G Phage-encoded combinatorial chemical libraries based on bicyclic peptides. Nat Chem Biol5:502-7 (2009) 
 
Cathepsin G
Name:Cathepsin G
Type:PROTEIN
Mol. Mass.:28860.08
Organism:Homo sapiens (Human)
Description:ChEMBL_1469016
Residue:255
BDBM50326029
NameBDBM50326029
Synonyms:CHEMBL1240609
TypeSmall organic molecule
Emp. Form.C90H112N20O25S3
Mol. Mass.1970.166
SMILESCC(C)[C@@H]1NC(=O)[C@H](CC(O)=O)NC(=O)[C@H](Cc2ccc(O)cc2)NC(=O)[C@H](CCC(O)=O)NC(=O)[C@H](CSCc2cc3CSC[C@H](NC(=O)[C@H](CCC(N)=O)NC(=O)CNC(=O)[C@H](Cc4ccccc4)NC(=O)CNC(=O)[C@H](CC(O)=O)NC(=O)[C@H](Cc4c[nH]c5ccccc45)NC(=O)[C@H](CSCc(c3)c2)NC(=O)[C@H](Cc2ccccc2)NC(=O)CNC1=O)C(=O)NCC(N)=O)NC(=O)[C@H](C)N