Reaction Details
TargetPlasma kallikrein
LigandBDBM50326037
Substrate/Competitorn/a
Meas. Tech.ChEMBL_655590 (CHEMBL1244634)
IC50 2000±n/a nM
Citation Heinis, CRutherford, TFreund, SWinter, G Phage-encoded combinatorial chemical libraries based on bicyclic peptides. Nat Chem Biol5:502-7 (2009) 
 
Plasma kallikrein
Name:Plasma kallikrein
Type:Protein
Mol. Mass.:71391.16
Organism:Homo sapiens (Human)
Description:P03952
Residue:638
BDBM50326037
NameBDBM50326037
Synonyms:CHEMBL1240604
TypeSmall organic molecule
Emp. Form.C72H115N27O24S3
Mol. Mass.1839.045
SMILESCC[C@H](C)[C@@H]1NC(=O)[C@H](CC(N)=O)NC(=O)[C@H](CC(N)=O)NC(=O)[C@@H](NC(=O)[C@H](CCCNC(N)=N)NC(=O)[C@@H]2CSCc3cc(CSC[C@H](NC(=O)[C@H](CO)NC1=O)C(=O)NCC(N)=O)cc(CSC[C@H](NC(=O)[C@H](C)N)C(=O)NCC(=O)NCC(=O)N[C@@H](CC(N)=O)C(=O)N[C@@H](CO)C(=O)N[C@@H](CC(O)=O)C(=O)N[C@@H](CCCNC(N)=N)C(=O)N2)c3)C(C)C