Reaction Details
TargetReceptor tyrosine-protein kinase erbB-2
LigandBDBM50326046
Substrate/Competitorn/a
Meas. Tech.ChEMBL_655603 (CHEMBL1244647)
Ki 30000±n/a nM
Citation Heinis, CRutherford, TFreund, SWinter, G Phage-encoded combinatorial chemical libraries based on bicyclic peptides. Nat Chem Biol5:502-7 (2009) 
 
Receptor tyrosine-protein kinase erbB-2
Name:Receptor tyrosine-protein kinase erbB-2
Type:n/a
Mol. Mass.:137894.47
Organism:Homo sapiens (Human)
Description:P04626
Residue:1255
BDBM50326046
NameBDBM50326046
Synonyms:(2S,5S,8S,11R,14R,17S)-17,21-diamino-8-(4-hydroxybenzyl)-5-(hydroxymethyl)-2-isobutyl-11,14-bis(mercaptomethyl)-4,7,10,13,16-pentaoxo-3,6,9,12,15-pentaazahenicosan-1-oic acid | CHEMBL1240683
TypeSmall organic molecule
Emp. Form.C30H49N7O9S2
Mol. Mass.715.882
SMILESCC(C)C[C@H](NC(=O)[C@H](CO)NC(=O)[C@H](Cc1ccc(O)cc1)NC(=O)[C@H](CS)NC(=O)[C@H](CS)NC(=O)[C@@H](N)CCCCN)C(O)=O