Reaction Details
TargetKallikrein-2
LigandBDBM50326050
Substrate/Competitorn/a
Meas. Tech.ChEMBL_655598 (CHEMBL1244642)
IC50 3400±n/a nM
Citation Heinis, CRutherford, TFreund, SWinter, G Phage-encoded combinatorial chemical libraries based on bicyclic peptides. Nat Chem Biol5:502-7 (2009) 
 
Kallikrein-2
Name:Kallikrein-2
Type:PROTEIN
Mol. Mass.:28673.68
Organism:Homo sapiens (Human)
Description:ChEMBL_862797
Residue:261
BDBM50326050
NameBDBM50326050
Synonyms:CHEMBL1240617
TypeSmall organic molecule
Emp. Form.C66H88N16O12
Mol. Mass.1297.5049
SMILESCC(C)[C@H](NC(=O)[C@H](CCCCN)NC(=O)[C@H](Cc1ccccc1)NC(=O)[C@H](CCCN=C(N)N)NC(=O)[C@@H](N)CO)C(=O)N[C@@H](Cc1c[nH]c2ccccc12)C(=O)N[C@@H](Cc1c[nH]c2ccccc12)C(=O)N[C@@H](C)C(=O)N[C@@H](C)C(=O)N[C@@H](Cc1ccccc1)C(O)=O