Reaction Details
TargetCarbonic anhydrase 12
LigandBDBM50326110
Substrate/Competitorn/a
Meas. Tech.ChEMBL_659853 (CHEMBL1246743)
Ki 75±n/a nM
Citation Brzozowski, ZSlawinski, JInnocenti, ASupuran, CT Carbonic anhydrase inhibitors. Regioselective synthesis of novel 1-substituted 1,4-dihydro-4-oxo-3-pyridinesulfonamides and their inhibition of the human cytosolic isozymes I and II and transmembrane cancer-associated isozymes IX and XII. Eur J Med Chem45:3656-61 (2010) 
 
Carbonic anhydrase 12
Name:Carbonic anhydrase 12
Type:Enzyme
Mol. Mass.:39456.00
Organism:Homo sapiens (Human)
Description:Catalytic domain of human cloned isozyme was used in the assay
Residue:354
BDBM50326110
NameBDBM50326110
Synonyms:1,4-Dihydro-1-(7-nitrofurazon-4-yl)-4-oxo-3-pyridinesulfonamide | CHEMBL1242891
TypeSmall organic molecule
Emp. Form.C11H7N5O6S
Mol. Mass.337.268
SMILESNS(=O)(=O)c1cn(ccc1=O)-c1ccc([N+]([O-])=O)c2[n-][o+]nc12