Reaction Details
TargetCarbonic anhydrase 2
LigandBDBM10881
Substrate/Competitorn/a
Meas. Tech.ChEMBL_659851 (CHEMBL1246741)
Ki 14±n/a nM
Citation Brzozowski, ZSlawinski, JInnocenti, ASupuran, CT Carbonic anhydrase inhibitors. Regioselective synthesis of novel 1-substituted 1,4-dihydro-4-oxo-3-pyridinesulfonamides and their inhibition of the human cytosolic isozymes I and II and transmembrane cancer-associated isozymes IX and XII. Eur J Med Chem45:3656-61 (2010) 
 
Carbonic anhydrase 2
Name:Carbonic anhydrase 2
Type:Enzyme
Mol. Mass.:29250.71
Organism:Homo sapiens (Human)
Description:P00918
Residue:260
BDBM10881
NameBDBM10881
Synonyms:CHEMBL288100 Methazolamide Methazolamide, MZA Sulfonamide, 2 sulfonamide 2
TypeSmall organic molecule
Emp. Form.C5H8N4O3S2
Mol. Mass.236.272
SMILESCC(=O)N=c1sc(nn1C)S(N)(=O)=O