Reaction Details
TargetCarbonic anhydrase 12
LigandBDBM50326114
Substrate/Competitorn/a
Meas. Tech.ChEMBL_659853 (CHEMBL1246743)
Ki 32.5±n/a nM
Citation Brzozowski, ZSlawinski, JInnocenti, ASupuran, CT Carbonic anhydrase inhibitors. Regioselective synthesis of novel 1-substituted 1,4-dihydro-4-oxo-3-pyridinesulfonamides and their inhibition of the human cytosolic isozymes I and II and transmembrane cancer-associated isozymes IX and XII. Eur J Med Chem45:3656-61 (2010) 
 
Carbonic anhydrase 12
Name:Carbonic anhydrase 12
Type:Enzyme
Mol. Mass.:39456.00
Organism:Homo sapiens (Human)
Description:Catalytic domain of human cloned isozyme was used in the assay
Residue:354
BDBM50326114
NameBDBM50326114
Synonyms:1-(4-Fluorophenacyl)-1,4-dihydro-4-oxo-3-pyridinesulfonamide | CHEMBL1242705
TypeSmall organic molecule
Emp. Form.C13H11FN2O4S
Mol. Mass.310.301
SMILESNS(=O)(=O)c1cn(CC(=O)c2ccc(F)cc2)ccc1=O