Reaction Details
TargetTranscription factor Jun
LigandBDBM50326120
Substrate/Competitorn/a
Meas. Tech.ChEMBL_657293 (CHEMBL1249120)
IC50 14000±n/a nM
Citation Giri, RSThaker, HMGiordano, TChen, BNuthalapaty, SVasu, KKSudarsanam, V Synthesis and evaluation of quinazolinone derivatives as inhibitors of NF-kappaB, AP-1 mediated transcription and eIF-4E mediated translational activation: inhibitors of multi-pathways involve in cancer. Eur J Med Chem45:3558-63 (2010) 
 
Transcription factor Jun
Name:Transcription factor Jun
Type:n/a
Mol. Mass.:35683.24
Organism:Homo sapiens (Human)
Description:P05412
Residue:331
BDBM50326120
NameBDBM50326120
Synonyms:2-[2-(4-Chloro-phenylamino)-4-phenyl-thiazol-5-yl]-3-(4-methoxy-phenyl)-3H quinazolin-4-one | CHEMBL1242519
TypeSmall organic molecule
Emp. Form.C30H21ClN4O2S
Mol. Mass.537.031
SMILESCOc1ccc(cc1)-n1c(nc2ccccc2c1=O)-c1sc(Nc2ccc(Cl)cc2)nc1-c1ccccc1