Reaction Details
TargetTranscription factor Jun
LigandBDBM50326121
Substrate/Competitorn/a
Meas. Tech.ChEMBL_657293 (CHEMBL1249120)
IC50 10000±n/a nM
Citation Giri, RSThaker, HMGiordano, TChen, BNuthalapaty, SVasu, KKSudarsanam, V Synthesis and evaluation of quinazolinone derivatives as inhibitors of NF-kappaB, AP-1 mediated transcription and eIF-4E mediated translational activation: inhibitors of multi-pathways involve in cancer. Eur J Med Chem45:3558-63 (2010) 
 
Transcription factor Jun
Name:Transcription factor Jun
Type:n/a
Mol. Mass.:35683.24
Organism:Homo sapiens (Human)
Description:P05412
Residue:331
BDBM50326121
NameBDBM50326121
Synonyms:CHEMBL1242520 | {5-[3-(4-Chloro-phenyl)-4-oxo-3,4-dihydro-quinazolin-2-yl]-4-methyl-thiazol-2-yl}-carbamic acid ethyl ester
TypeSmall organic molecule
Emp. Form.C21H17ClN4O3S
Mol. Mass.440.903
SMILESCCOC(=O)Nc1nc(C)c(s1)-c1nc2ccccc2c(=O)n1-c1ccc(Cl)cc1