Reaction Details
TargetTranscription factor Jun
LigandBDBM50279429
Substrate/Competitorn/a
Meas. Tech.ChEMBL_657293 (CHEMBL1249120)
IC50 3000±n/a nM
Citation Giri, RSThaker, HMGiordano, TChen, BNuthalapaty, SVasu, KKSudarsanam, V Synthesis and evaluation of quinazolinone derivatives as inhibitors of NF-kappaB, AP-1 mediated transcription and eIF-4E mediated translational activation: inhibitors of multi-pathways involve in cancer. Eur J Med Chem45:3558-63 (2010) 
 
Transcription factor Jun
Name:Transcription factor Jun
Type:n/a
Mol. Mass.:35683.24
Organism:Homo sapiens (Human)
Description:P05412
Residue:331
BDBM50279429
NameBDBM50279429
Synonyms:3-(4-Chloro-phenyl)-2-(4-methyl-2-methylamino-thiazol-5-yl)-3H-quinazolin-4-one | CHEMBL487336
TypeSmall organic molecule
Emp. Form.C19H15ClN4OS
Mol. Mass.382.867
SMILESCNc1nc(C)c(s1)-c1nc2ccccc2c(=O)n1-c1ccc(Cl)cc1