Reaction Details
TargetTranscription factor Jun
LigandBDBM50279431
Substrate/Competitorn/a
Meas. Tech.ChEMBL_657293 (CHEMBL1249120)
IC50 1200±n/a nM
Citation Giri, RSThaker, HMGiordano, TChen, BNuthalapaty, SVasu, KKSudarsanam, V Synthesis and evaluation of quinazolinone derivatives as inhibitors of NF-kappaB, AP-1 mediated transcription and eIF-4E mediated translational activation: inhibitors of multi-pathways involve in cancer. Eur J Med Chem45:3558-63 (2010) 
 
Transcription factor Jun
Name:Transcription factor Jun
Type:n/a
Mol. Mass.:35683.24
Organism:Homo sapiens (Human)
Description:P05412
Residue:331
BDBM50279431
NameBDBM50279431
Synonyms:3-(4-Chloro-phenyl)-2-[2-(4-chloro-phenylamino)-4-methyl-thiazol-5-yl]-3H-quinazolin-4-one | CHEMBL485904
TypeSmall organic molecule
Emp. Form.C24H16Cl2N4OS
Mol. Mass.479.381
SMILESCc1nc(Nc2ccc(Cl)cc2)sc1-c1nc2ccccc2c(=O)n1-c1ccc(Cl)cc1