Reaction Details
TargetE3 ubiquitin-protein ligase XIAP
LigandBDBM50326216
Substrate/Competitorn/a
Meas. Tech.ChEMBL_659379 (CHEMBL1248006)
IC50 125±n/a nM
Citation Sun, HLu, JLiu, LYi, HQiu, SYang, CYDeschamps, JRWang, S Nonpeptidic and potent small-molecule inhibitors of cIAP-1/2 and XIAP proteins. J Med Chem53:6361-7 (2010) 
 
E3 ubiquitin-protein ligase XIAP
Name:E3 ubiquitin-protein ligase XIAP
Type:Protein
Mol. Mass.:56685.27
Organism:Homo sapiens (Human)
Description:P98170
Residue:497
BDBM50326216
NameBDBM50326216
Synonyms:(3S,6S,9R,10aR)-6-((S)-2-(Methylamino)propanamido)-5-oxo-9-(2-phenylacetamido)-N-((R)-1,2,3,4-tetrahydronaphthalen-1-yl)decahydropyrrolo[1,2-a]azocine-3-carboxamide | CHEMBL1241426
TypeSmall organic molecule
Emp. Form.C33H43N5O4
Mol. Mass.573.7256
SMILESCN[C@@H](C)C(=O)N[C@H]1CC[C@H](C[C@H]2CC[C@H](N2C1=O)C(=O)N[C@@H]1CCCc2ccccc12)NC(=O)Cc1ccccc1