Reaction Details
TargetCalpain-1 catalytic subunit
LigandBDBM50326299
Substrate/Competitorn/a
Meas. Tech.ChEMBL_659958 (CHEMBL1247359)
Ki 165±n/a nM
Citation Ovat, ALi, ZZHampton, CYAsress, SAFernández, FMGlass, JDPowers, JC Peptidyl alpha-ketoamides with nucleobases, methylpiperazine, and dimethylaminoalkyl substituents as calpain inhibitors. J Med Chem53:6326-36 (2010) 
 
Calpain-1 catalytic subunit
Name:Calpain-1 catalytic subunit
Type:Catalytic subunit; forms a heterodimer with a small (regulatory) subunit (CAPNS1)
Mol. Mass.:81729.82
Organism:Sus scrofa (pig)
Description:Native calpain-1 from porcine erythrocytes, purchased from Calbiochem, was used in assay.
Residue:714
BDBM50326299
NameBDBM50326299
Synonyms:3-(Benzyloxycarbonyl-L-leucylamino)-N-(3-(4-amino-2-oxopyrimidin-1(2H)-yl)propyl))-2-oxopentanamide | CHEMBL1242986
TypeSmall organic molecule
Emp. Form.C26H36N6O6
Mol. Mass.528.6006
SMILESCCC(NC(=O)[C@H](CC(C)C)NC(=O)OCc1ccccc1)C(=O)C(=O)NCCCn1ccc(N)nc1=O