Reaction Details
TargetCalpain-2 catalytic subunit
LigandBDBM50326300
Substrate/Competitorn/a
Meas. Tech.ChEMBL_659959 (CHEMBL1247360)
Ki 77±n/a nM
Citation Ovat, ALi, ZZHampton, CYAsress, SAFernández, FMGlass, JDPowers, JC Peptidyl alpha-ketoamides with nucleobases, methylpiperazine, and dimethylaminoalkyl substituents as calpain inhibitors. J Med Chem53:6326-36 (2010) 
 
Calpain-2 catalytic subunit
Name:Calpain-2 catalytic subunit
Type:n/a
Mol. Mass.:37789.71
Organism:Sus scrofa
Description:n/a
Residue:324
BDBM50326300
NameBDBM50326300
Synonyms:3-(Benzyloxycarbonyl-L-leucylamino)-N-(3-(6-amino-2-methoxy-9H-purin-9-yl)propyl)-2-oxopentanamide | CHEMBL1240873
TypeSmall organic molecule
Emp. Form.C28H38N8O6
Mol. Mass.582.6513
SMILESCCC(NC(=O)[C@H](CC(C)C)NC(=O)OCc1ccccc1)C(=O)C(=O)NCCCn1cnc2c(N)nc(OC)nc12