Reaction Details
TargetCalpain-1 catalytic subunit
LigandBDBM50326304
Substrate/Competitorn/a
Meas. Tech.ChEMBL_659958 (CHEMBL1247359)
Ki 55±n/a nM
Citation Ovat, ALi, ZZHampton, CYAsress, SAFernández, FMGlass, JDPowers, JC Peptidyl alpha-ketoamides with nucleobases, methylpiperazine, and dimethylaminoalkyl substituents as calpain inhibitors. J Med Chem53:6326-36 (2010) 
 
Calpain-1 catalytic subunit
Name:Calpain-1 catalytic subunit
Type:Catalytic subunit; forms a heterodimer with a small (regulatory) subunit (CAPNS1)
Mol. Mass.:81729.82
Organism:Sus scrofa (pig)
Description:Native calpain-1 from porcine erythrocytes, purchased from Calbiochem, was used in assay.
Residue:714
BDBM50326304
NameBDBM50326304
Synonyms:3-(Benzyloxycarbonyl-L-leucylamino)-N-(3-(6-amino-9H-purin-9-yl)propyl)-2-oxophenylbutanamide | CHEMBL1240872
TypeSmall organic molecule
Emp. Form.C32H38N8O5
Mol. Mass.614.6947
SMILESCC(C)C[C@H](NC(=O)OCc1ccccc1)C(=O)NC(Cc1ccccc1)C(=O)C(=O)NCCCn1cnc2c(N)ncnc12