Reaction Details
TargetCathepsin B
LigandBDBM50326306
Substrate/Competitorn/a
Meas. Tech.ChEMBL_659960 (CHEMBL1247361)
Ki 75500±n/a nM
Citation Ovat, ALi, ZZHampton, CYAsress, SAFernández, FMGlass, JDPowers, JC Peptidyl alpha-ketoamides with nucleobases, methylpiperazine, and dimethylaminoalkyl substituents as calpain inhibitors. J Med Chem53:6326-36 (2010) 
 
Cathepsin B
Name:Cathepsin B
Type:Enzyme
Mol. Mass.:37819.69
Organism:Homo sapiens (Human)
Description:gi_63102437
Residue:339
BDBM50326306
NameBDBM50326306
Synonyms:3-(Benzyloxycarbonyl-L-leucylamino)-N-(3-(dimethylamino)-propyl)-2-oxophenylbutanamide | CHEMBL1242932
TypeSmall organic molecule
Emp. Form.C29H40N4O5
Mol. Mass.524.6517
SMILESCC(C)C[C@H](NC(=O)OCc1ccccc1)C(=O)NC(Cc1ccccc1)C(=O)C(=O)NCCCN(C)C