Reaction Details
TargetB1 bradykinin receptor
LigandBDBM50156455
Substrate/Competitorn/a
Meas. Tech.ChEMBL_662794 (CHEMBL1252533)
IC50 163.5±n/a nM
Citation Huang, HPlayer, MR Bradykinin B1 receptor antagonists as potential therapeutic agents for pain. J Med Chem53:5383-99 (2010) 
 
B1 bradykinin receptor
Name:B1 bradykinin receptor
Type:Enzyme Catalytic Domain
Mol. Mass.:38389.97
Organism:RAT
Description:B1 BRADYKININ BDKRB1 RAT::P97583
Residue:337
BDBM50156455
NameBDBM50156455
Synonyms:(R)-N-(4-(4,5-dihydro-1H-imidazol-2-yl)phenethyl)-2-(1-(3,4-dichlorophenylsulfonyl)-3-oxo-1,2,3,4-tetrahydroquinoxalin-2-yl)acetamide CHEMBL189123
TypeSmall organic molecule
Emp. Form.C27H25Cl2N5O4S
Mol. Mass.586.49
SMILESClc1ccc(cc1Cl)S(=O)(=O)N1[C@H](CC(=O)NCCc2ccc(cc2)C2=NCCN2)C(=O)Nc2ccccc12