Reaction Details
TargetB1 bradykinin receptor
LigandBDBM50151891
Substrate/Competitorn/a
Meas. Tech.ChEMBL_662792 (CHEMBL1252531)
Ki 8±n/a nM
Citation Huang, HPlayer, MR Bradykinin B1 receptor antagonists as potential therapeutic agents for pain. J Med Chem53:5383-99 (2010) 
 
B1 bradykinin receptor
Name:B1 bradykinin receptor
Type:Enzyme
Mol. Mass.:40508.87
Organism:Homo sapiens (Human)
Description:P46663
Residue:353
BDBM50151891
NameBDBM50151891
Synonyms:CHEMBL273869 | {2-(2,2-Diphenyl-ethylamino)-5-[4-(4-methyl-piperazine-1-carbonyl)-piperidine-1-sulfonyl]-phenyl}-morpholin-4-yl-methanone
TypeSmall organic molecule
Emp. Form.C36H45N5O5S
Mol. Mass.659.838
SMILESCN1CCN(CC1)C(=O)C1CCN(CC1)S(=O)(=O)c1ccc(NCC(c2ccccc2)c2ccccc2)c(c1)C(=O)N1CCOCC1