Reaction Details
TargetOxytocin receptor
LigandBDBM50326722
Substrate/Competitorn/a
Meas. Tech.ChEMBL_661577 (CHEMBL1253141)
Ki 0.65±n/a nM
Citation Borthwick, AD Oral oxytocin antagonists. J Med Chem53:6525-38 (2010) 
 
Oxytocin receptor
Name:Oxytocin receptor
Type:Enzyme Catalytic Domain
Mol. Mass.:42793.26
Organism:Homo sapiens (Human)
Description:Oxytocin OXTR HEK293::B2R9L7
Residue:389
BDBM50326722
NameBDBM50326722
Synonyms:(Z)-3-(4-(N-(4-chlorophenyl)-N-(2-oxo-2-(2-(2-oxoindolin-3-ylidene)hydrazinyl)ethyl)sulfamoyl)phenyl)-N-(3-(dimethylamino)propyl)propanamide CHEMBL445816
TypeSmall organic molecule
Emp. Form.C30H33ClN6O5S
Mol. Mass.625.138
SMILESCN(C)CCCNC(=O)CCc1ccc(cc1)S(=O)(=O)N(CC(=O)N\N=C1/C(=O)Nc2ccccc12)c1ccc(Cl)cc1