Reaction Details
TargetSterol 26-hydroxylase, mitochondrial
LigandBDBM50326835
Substrate/Competitorn/a
Meas. Tech.ChEMBL_662819 (CHEMBL1252219)
IC50 59±n/a nM
Citation Aboraia, ASMakowski, BBahja, AProsser, DBrancale, AJones, GSimons, C Synthesis and CYP24A1 inhibitory activity of (E)-2-(2-substituted benzylidene)- and 2-(2-substituted benzyl)-6-methoxy-tetralones. Eur J Med Chem45:4427-34 (2010) 
 
Sterol 26-hydroxylase, mitochondrial
Name:Sterol 26-hydroxylase, mitochondrial
Type:PROTEIN
Mol. Mass.:60250.67
Organism:Homo sapiens (Human)
Description:ChEMBL_430507
Residue:531
BDBM50326835
NameBDBM50326835
Synonyms:2-(2-Bromobenzyl)-6-methoxy-tetralone | CHEMBL1253946
TypeSmall organic molecule
Emp. Form.C18H17BrO2
Mol. Mass.345.23
SMILESCOc1ccc2C(=O)C(Cc3ccccc3Br)CCc2c1