Reaction Details
TargetAdenosine receptor A1
LigandBDBM50327327
Substrate/Competitorn/a
Meas. Tech.ChEMBL_664373 (CHEMBL1259522)
IC50 1.39±n/a nM
Citation Griebenow, NBärfacker, LMeier, HSchneider, DTeusch, NLustig, KKast, RKolkhof, P Identification and optimization of substituted 5-aminopyrazoles as potent and selective adenosine A1 receptor antagonists. Bioorg Med Chem Lett20:5891-4 (2010) 
 
Adenosine receptor A1
Name:Adenosine receptor A1
Type:G Protein-Coupled Receptor (GPCR)
Mol. Mass.:36520.92
Organism:Homo sapiens (Human)
Description:P30542
Residue:326
BDBM50327327
NameBDBM50327327
Synonyms:2-(4-(4-fluorophenyl)-3-methyl-1-o-tolyl-1H-pyrazol-5-ylamino)-5-methoxybenzoic acid | CHEMBL1257826
TypeSmall organic molecule
Emp. Form.C25H22FN3O3
Mol. Mass.431.4589
SMILESCOc1ccc(Nc2c(c(C)nn2-c2ccccc2C)-c2ccc(F)cc2)c(c1)C(O)=O