Reaction Details
Target5-hydroxytryptamine receptor 1A
LigandBDBM50327609
Substrate/Competitorn/a
Meas. Tech.ChEMBL_664675 (CHEMBL1260561)
Ki 0.128±n/a nM
Citation Favor, DAPowers, JJWhite, ADFitzgerald, LWGroppi, VSerpa, KA 6-Alkoxyisoindolin-1-one based dopamine D2 partial agonists as potential antipsychotics. Bioorg Med Chem Lett20:5666-9 (2010) 
 
5-hydroxytryptamine receptor 1A
Name:5-hydroxytryptamine receptor 1A
Type:n/a
Mol. Mass.:46122.49
Organism:Homo sapiens (Human)
Description:n/a
Residue:422
BDBM50327609
NameBDBM50327609
Synonyms:7-fluoro-6-(3-(4-(naphthalen-1-yl)piperazin-1-yl)propoxy)isoindolin-1-one | CHEMBL1257969
TypeSmall organic molecule
Emp. Form.C25H26FN3O2
Mol. Mass.419.4912
SMILESFc1c2C(=O)NCc2ccc1OCCCN1CCN(CC1)c1cccc2ccccc12