Reaction Details
Target5-hydroxytryptamine receptor 1A
LigandBDBM50327573
Substrate/Competitorn/a
Meas. Tech.ChEMBL_664674 (CHEMBL1260560)
Ki 0.204±n/a nM
Citation Favor, DAPowers, JJWhite, ADFitzgerald, LWGroppi, VSerpa, KA 6-Alkoxyisoindolin-1-one based dopamine D2 partial agonists as potential antipsychotics. Bioorg Med Chem Lett20:5666-9 (2010) 
 
5-hydroxytryptamine receptor 1A
Name:5-hydroxytryptamine receptor 1A
Type:n/a
Mol. Mass.:46122.49
Organism:Homo sapiens (Human)
Description:n/a
Residue:422
BDBM50327573
NameBDBM50327573
Synonyms:5-(4-(4-(naphthalen-1-yl)piperazin-1-yl)butoxy)isoindoline | CHEMBL1258425
TypeSmall organic molecule
Emp. Form.C26H31N3O
Mol. Mass.401.5438
SMILESC(CCN1CCN(CC1)c1cccc2ccccc12)COc1ccc2CNCc2c1