Reaction Details
Target5-hydroxytryptamine receptor 1A
LigandBDBM50327611
Substrate/Competitorn/a
Meas. Tech.ChEMBL_664674 (CHEMBL1260560)
Ki 0.243±n/a nM
Citation Favor, DAPowers, JJWhite, ADFitzgerald, LWGroppi, VSerpa, KA 6-Alkoxyisoindolin-1-one based dopamine D2 partial agonists as potential antipsychotics. Bioorg Med Chem Lett20:5666-9 (2010) 
 
5-hydroxytryptamine receptor 1A
Name:5-hydroxytryptamine receptor 1A
Type:n/a
Mol. Mass.:46122.49
Organism:Homo sapiens (Human)
Description:n/a
Residue:422
BDBM50327611
NameBDBM50327611
Synonyms:5-(4-(4-(7-fluoronaphthalen-1-yl)piperazin-1-yl)butoxy)isoindoline | CHEMBL1258532
TypeSmall organic molecule
Emp. Form.C26H30FN3O
Mol. Mass.419.5343
SMILESFc1ccc2cccc(N3CCN(CCCCOc4ccc5CNCc5c4)CC3)c2c1