Reaction Details
Target5-hydroxytryptamine receptor 2A
LigandBDBM50327607
Substrate/Competitorn/a
Meas. Tech.ChEMBL_664673 (CHEMBL1260559)
Ki 0.72±n/a nM
Citation Favor, DAPowers, JJWhite, ADFitzgerald, LWGroppi, VSerpa, KA 6-Alkoxyisoindolin-1-one based dopamine D2 partial agonists as potential antipsychotics. Bioorg Med Chem Lett20:5666-9 (2010) 
 
5-hydroxytryptamine receptor 2A
Name:5-hydroxytryptamine receptor 2A
Type:undefined
Mol. Mass.:52607.65
Organism:Homo sapiens (Human)
Description:P28223
Residue:471
BDBM50327607
NameBDBM50327607
Synonyms:5-(3-(4-(7-fluoronaphthalen-1-yl)piperazin-1-yl)propoxy)isoindoline | CHEMBL1258426
TypeSmall organic molecule
Emp. Form.C25H28FN3O
Mol. Mass.405.5077
SMILESFc1ccc2cccc(N3CCN(CCCOc4ccc5CNCc5c4)CC3)c2c1