Reaction Details
TargetBifunctional epoxide hydrolase 2
LigandBDBM50327845
Substrate/Competitorn/a
Meas. Tech.ChEMBL_664904 (CHEMBL1259736)
IC50 0.4±n/a nM
Citation Rose, TEMorisseau, CLiu, JYInceoglu, BJones, PDSanborn, JRHammock, BD 1-Aryl-3-(1-acylpiperidin-4-yl)urea inhibitors of human and murine soluble epoxide hydrolase: structure-activity relationships, pharmacokinetics, and reduction of inflammatory pain. J Med Chem53:7067-75 (2010) 
 
Bifunctional epoxide hydrolase 2
Name:Bifunctional epoxide hydrolase 2
Type:Enzyme
Mol. Mass.:62613.07
Organism:Homo sapiens (Human)
Description:P34913
Residue:555
BDBM50327845
NameBDBM50327845
Synonyms:1-(4-Perfluoroisopropylphenyl)-3-(1-propionylpiperidin-4-yl)urea US9296693, 38
TypeSmall organic molecule
Emp. Form.C18H20F7N3O2
Mol. Mass.443.3591
SMILESCCC(=O)N1CCC(CC1)NC(=O)Nc1ccc(cc1)C(F)(C(F)(F)F)C(F)(F)F