Reaction Details
TargetBifunctional epoxide hydrolase 2
LigandBDBM50327850
Substrate/Competitorn/a
Meas. Tech.ChEMBL_664904 (CHEMBL1259736)
IC50 0.4±n/a nM
Citation Rose, TEMorisseau, CLiu, JYInceoglu, BJones, PDSanborn, JRHammock, BD 1-Aryl-3-(1-acylpiperidin-4-yl)urea inhibitors of human and murine soluble epoxide hydrolase: structure-activity relationships, pharmacokinetics, and reduction of inflammatory pain. J Med Chem53:7067-75 (2010) 
 
Bifunctional epoxide hydrolase 2
Name:Bifunctional epoxide hydrolase 2
Type:Enzyme
Mol. Mass.:62613.07
Organism:Homo sapiens (Human)
Description:P34913
Residue:555
BDBM50327850
NameBDBM50327850
Synonyms:1-(1-Tosylpiperidin-4-yl)-3-(4-(trifluoromethoxy)phenyl)urea US8501783, 1711 | US9296693, 58
TypeSmall organic molecule
Emp. Form.C20H22F3N3O4S
Mol. Mass.457.467
SMILESCc1ccc(cc1)S(=O)(=O)N1CCC(CC1)NC(=O)Nc1ccc(OC(F)(F)F)cc1