Reaction Details
TargetBifunctional epoxide hydrolase 2
LigandBDBM50327853
Substrate/Competitorn/a
Meas. Tech.ChEMBL_664906 (CHEMBL1259738)
IC50 0.6±n/a nM
Citation Rose, TEMorisseau, CLiu, JYInceoglu, BJones, PDSanborn, JRHammock, BD 1-Aryl-3-(1-acylpiperidin-4-yl)urea inhibitors of human and murine soluble epoxide hydrolase: structure-activity relationships, pharmacokinetics, and reduction of inflammatory pain. J Med Chem53:7067-75 (2010) 
 
Bifunctional epoxide hydrolase 2
Name:Bifunctional epoxide hydrolase 2
Type:Enzyme
Mol. Mass.:62512.06
Organism:Mus musculus (Mouse)
Description:P34914
Residue:554
BDBM50327853
NameBDBM50327853
Synonyms:1-(3,4-Dichlorophenyl)-3-(1-propionylpiperidin-4-yl)urea US9296693, 32
TypeSmall organic molecule
Emp. Form.C15H19Cl2N3O2
Mol. Mass.344.236
SMILESCCC(=O)N1CCC(CC1)NC(=O)Nc1ccc(Cl)c(Cl)c1