Reaction Details
TargetProtein kinase C epsilon type
LigandBDBM50327946
Substrate/Competitorn/a
Meas. Tech.ChEMBL_665135 (CHEMBL1260398)
Ki 25±n/a nM
Citation Yanagita, RCKamachi, HTanaka, KMurakami, ANakagawa, YTokuda, HNagai, HIrie, K Role of the phenolic hydroxyl group in the biological activities of simplified analogue of aplysiatoxin with antiproliferative activity. Bioorg Med Chem Lett20:6064-6 (2010) 
 
Protein kinase C epsilon type
Name:Protein kinase C epsilon type
Type:Enzyme
Mol. Mass.:83680.45
Organism:Homo sapiens (Human)
Description:The recombinant human PKC enzymes were produced using a baculovirus expression system in SF9 cells
Residue:737
BDBM50327946
NameBDBM50327946
Synonyms:1S,3R,5R,9R,13R)-9-Hydroxymethyl-3-[4-(3-hydroxy-phenyl)-butyl]-16,16-dimethyl-2,6,10,17-tetraoxa-tricyc lo[11.3.1.1'1,5']octadecane-7,11-dione | CHEMBL1258348
TypeSmall organic molecule
Emp. Form.C27H38O8
Mol. Mass.490.5858
SMILESCC1(C)CC[C@@H]2CC(=O)O[C@@H](CO)CC(=O)O[C@@H]3C[C@@H](CCCCc4cccc(O)c4)O[C@@]1(C3)O2