Reaction Details
TargetProlyl hydroxylase EGLN2
LigandBDBM50328019
Substrate/Competitorn/a
Meas. Tech.ChEMBL_665252 (CHEMBL1260833)
IC50 91090±n/a nM
Citation Conejo-Garcia, AMcDonough, MALoenarz, CMcNeill, LAHewitson, KSGe, WLiénard, BMSchofield, CJClifton, IJ Structural basis for binding of cyclic 2-oxoglutarate analogues to factor-inhibiting hypoxia-inducible factor. Bioorg Med Chem Lett20:6125-8 (2010) 
 
Prolyl hydroxylase EGLN2
Name:Prolyl hydroxylase EGLN2
Type:Protein
Mol. Mass.:43657.01
Organism:Homo sapiens (Human)
Description:Q96KS0
Residue:407
BDBM50328019
NameBDBM50328019
Synonyms:2-(3-hydroxypicolinamido)acetic acid | CHEMBL1256568
TypeSmall organic molecule
Emp. Form.C8H8N2O4
Mol. Mass.196.1601
SMILESOC(=O)CNC(=O)c1ncccc1O