Reaction Details
TargetD(2) dopamine receptor
LigandBDBM50328449
Substrate/Competitorn/a
Meas. Tech.ChEMBL_665575 (CHEMBL1261459)
Ki 19±n/a nM
Citation Skultety, MHübner, HLöber, SGmeiner, P Bioisosteric replacement leading to biologically active [2.2]paracyclophanes with altered binding profiles for aminergic G-protein-coupled receptors. J Med Chem53:7219-28 (2010) 
 
D(2) dopamine receptor
Name:D(2) dopamine receptor
Type:Cell-surface receptors
Mol. Mass.:50647.10
Organism:Homo sapiens (Human)
Description:P14416
Residue:443
BDBM50328449
NameBDBM50328449
Synonyms:4-[4-([2.2]Paracyclophan-4-yl)piperazin-1-yl]-1-(4-fluorophenyl)-butan-1-one | CHEMBL1258036
TypeSmall organic molecule
Emp. Form.C30H33FN2O
Mol. Mass.456.5942
SMILESFc1ccc(cc1)C(=O)CCCN1CCN(CC1)c1cc2CCc3ccc(CCc1cc2)cc3