Reaction Details
Target5-hydroxytryptamine receptor 2A
LigandBDBM50328453
Substrate/Competitorn/a
Meas. Tech.ChEMBL_665580 (CHEMBL1261464)
Ki 310±n/a nM
Citation Skultety, MHübner, HLöber, SGmeiner, P Bioisosteric replacement leading to biologically active [2.2]paracyclophanes with altered binding profiles for aminergic G-protein-coupled receptors. J Med Chem53:7219-28 (2010) 
 
5-hydroxytryptamine receptor 2A
Name:5-hydroxytryptamine receptor 2A
Type:Enzyme Catalytic Domain
Mol. Mass.:52679.13
Organism:PIG
Description:5-HT2 0 0::P50129
Residue:470
BDBM50328453
NameBDBM50328453
Synonyms:4-[4-([2.2]Paracyclophan-4-yl)piperazin-1-yl]-1-([2.2]paracyclophan-4-yl)butan-1-one | CHEMBL1256170
TypeSmall organic molecule
Emp. Form.C41H45NO
Mol. Mass.567.8021
SMILESO=C(CCCN1CCC(CC1)c1cc2CCc3ccc(CCc1cc2)cc3)c1cc2CCc3ccc(CCc1cc2)cc3