Reaction Details
TargetD(3) dopamine receptor
LigandBDBM50328444
Substrate/Competitorn/a
Meas. Tech.ChEMBL_665577 (CHEMBL1261461)
Ki 27±n/a nM
Citation Skultety, MHübner, HLöber, SGmeiner, P Bioisosteric replacement leading to biologically active [2.2]paracyclophanes with altered binding profiles for aminergic G-protein-coupled receptors. J Med Chem53:7219-28 (2010) 
 
D(3) dopamine receptor
Name:D(3) dopamine receptor
Type:n/a
Mol. Mass.:44243.43
Organism:Homo sapiens (Human)
Description:n/a
Residue:400
BDBM50328444
NameBDBM50328444
Synonyms:4-[4-(2,5-Dimethylphenyl)-4-hydroxypiperidin-1-yl]-1-(4-fluorophenyl)butan-1-one | CHEMBL1257689
TypeSmall organic molecule
Emp. Form.C23H28FNO2
Mol. Mass.369.4723
SMILESCc1ccc(C)c(c1)C1(O)CCN(CCCC(=O)c2ccc(F)cc2)CC1