Reaction Details
TargetD(3) dopamine receptor
LigandBDBM50328452
Substrate/Competitorn/a
Meas. Tech.ChEMBL_665577 (CHEMBL1261461)
Ki 290±n/a nM
Citation Skultety, MHübner, HLöber, SGmeiner, P Bioisosteric replacement leading to biologically active [2.2]paracyclophanes with altered binding profiles for aminergic G-protein-coupled receptors. J Med Chem53:7219-28 (2010) 
 
D(3) dopamine receptor
Name:D(3) dopamine receptor
Type:n/a
Mol. Mass.:44243.43
Organism:Homo sapiens (Human)
Description:n/a
Residue:400
BDBM50328452
NameBDBM50328452
Synonyms:4-[4-(4-Chlorophenyl)piperazin-1-yl]-1-(2,5-dimethylphenyl)-butan-1-one | CHEMBL1258155
TypeSmall organic molecule
Emp. Form.C23H28ClNO
Mol. Mass.369.928
SMILESCc1ccc(C)c(c1)C(=O)CCCN1CCC(CC1)c1ccc(Cl)cc1