Reaction Details
TargetAlpha-1A adrenergic receptor
LigandBDBM50328476
Substrate/Competitorn/a
Meas. Tech.ChEMBL_665656 (CHEMBL1261587)
Ki 0.66±n/a nM
Citation Kristensen, JLPüschl, AJensen, MRisgaard, RChristoffersen, CTBang-Andersen, BBalle, T Exploring the neuroleptic substituent in octoclothepin: potential ligands for positron emission tomography with subnanomolar affinity fora(1)-adrenoceptors. J Med Chem53:7021-34 (2010) 
 
Alpha-1A adrenergic receptor
Name:Alpha-1A adrenergic receptor
Type:Enzyme Catalytic Domain
Mol. Mass.:51492.08
Organism:CALF
Description:adrenergic Alpha1 0 CALF
Residue:466
BDBM50328476
NameBDBM50328476
Synonyms:1-(2-(4-(1-(4-fluorophenyl)-5-((2-methyl-2H-tetrazol-5-yl)methyl)-1H-indol-3-yl)piperidin-1-yl)ethyl)imidazolidin-2-one | CHEMBL1259188
TypeSmall organic molecule
Emp. Form.C27H31FN8O
Mol. Mass.502.5864
SMILESCn1nnc(Cc2ccc3n(cc(C4CCN(CCN5CCNC5=O)CC4)c3c2)-c2ccc(F)cc2)n1